Target
Mitogen-activated protein kinase kinase kinase 5
Ligand
BDBM187379
Substrate
Meas. Tech.
Apoptosis Signal-Regulating Kinase Assay
IC50
2.10±n/a nM
Citation
 Notte, G Apoptosis signal-regulating kinase inhibitors US Patent  US9908875 Publication Date 3/6/2018 
Target
Name:
Mitogen-activated protein kinase kinase kinase 5
Synonyms:
ASK1 MAP3K5 MEKK5
Type:
Protein
Mol. Mass.:
154514.93
Organism:
Homo sapiens (Human)
Description:
Q99683
Residue:
1374
  
Inhibitor
Name:
BDBM187379
Synonyms:
US9169243, 27 | US9908875, 27
Type:
Small organic molecule
Emp. Form.:
C24H22F5N9OS
Mol. Mass.:
579.548
SMILES:
C[C@H](n1cnnc1-c1nc(NC(=O)c2cc(c(cn2)N2CCC(F)(F)C2)-n2cnc(c2)C2CC2)cs1)C(F)(F)F
: