Target
Mitogen-activated protein kinase kinase kinase 5
Ligand
BDBM187382
Substrate
Meas. Tech.
Apoptosis Signal-Regulating Kinase Assay
IC50
2.30±n/a nM
Citation
 Notte, G Apoptosis signal-regulating kinase inhibitors US Patent  US9908875 Publication Date 3/6/2018 
Target
Name:
Mitogen-activated protein kinase kinase kinase 5
Synonyms:
ASK1 MAP3K5 MEKK5
Type:
Protein
Mol. Mass.:
154514.93
Organism:
Homo sapiens (Human)
Description:
Q99683
Residue:
1374
  
Inhibitor
Name:
BDBM187382
Synonyms:
US9169243, 30 | US9908875, 30
Type:
Small organic molecule
Emp. Form.:
C26H28F3N9O2S
Mol. Mass.:
587.62
SMILES:
COC1CCN(CC1)c1cnc(cc1-n1cnc(c1)C1CC1)C(=O)Nc1csc(n1)-c1nncn1[C@@H](C)C(F)(F)F
: