Target
Mitogen-activated protein kinase kinase kinase 5
Ligand
BDBM187384
Substrate
Meas. Tech.
Apoptosis Signal-Regulating Kinase Assay
IC50
1.50±n/a nM
Citation
 Notte, G Apoptosis signal-regulating kinase inhibitors US Patent  US9908875 Publication Date 3/6/2018 
Target
Name:
Mitogen-activated protein kinase kinase kinase 5
Synonyms:
ASK1 MAP3K5 MEKK5
Type:
Protein
Mol. Mass.:
154514.93
Organism:
Homo sapiens (Human)
Description:
Q99683
Residue:
1374
  
Inhibitor
Name:
BDBM187384
Synonyms:
US9169243, 32 | US9908875, 32
Type:
Small organic molecule
Emp. Form.:
C26H25F6N9OS
Mol. Mass.:
625.592
SMILES:
C[C@H](n1cnnc1-c1nc(NC(=O)c2cc(c(cn2)N2CCC(CC2)C(F)(F)F)-n2cnc(c2)C2CC2)cs1)C(F)(F)F
: