Target
D-amino-acid oxidase
Ligand
BDBM23177
Substrate
BDBM23167
Meas. Tech.
In vitro D-Amino Acid Oxidase Assay
pH
8.5±n/a
Temperature
295.15±n/a K
IC50
>100000±n/a nM
Citation
 Ferraris, DDuvall, BKo, YSThomas, AGRojas, CMajer, PHashimoto, KTsukamoto, T Synthesis and Biological Evaluation of d-Amino Acid Oxidase Inhibitors. J Med Chem 51:3357-9 (2008)  
Target
Name:
D-amino-acid oxidase
Synonyms:
D-Amino Acid Oxidase (DAAO) DAMOX OXDA_PIG
Type:
Flavoprotein
Mol. Mass.:
39338.01
Organism:
Sus scrofa (pig)
Description:
Homodimer.
Residue:
347
  
Inhibitor
Name:
BDBM23177
Synonyms:
6-ethoxy-1,2-benzoxazol-3-ol | Benzo[d]isoxazol-3-ol Derivative, 3i
Type:
Small organic molecule
Emp. Form.:
C9H9NO3
Mol. Mass.:
179.1727
SMILES:
CCOc1ccc2c(c1)o[nH]c2=O
:
Substrate
Name:
BDBM23167
Synonyms:
(2R)-2-amino-3-hydroxypropanoic acid D-Serine
Type:
Amino Acid
Emp. Form.:
C3H7NO3
Mol. Mass.:
105.0926
SMILES:
N[C@H](CO)C(O)=O
: