Target
Glycogen phosphorylase, muscle form
Ligand
BDBM23200
Substrate
BDBM23188
Meas. Tech.
Enzyme Inhibition Assay
pH
7.2±n/a
Temperature
295.15±n/a K
IC50
213000±n/a nM
Citation
 Wen, XSun, HLiu, JCheng, KZhang, PZhang, LHao, JZhang, LNi, PZographos, SELeonidas, DDAlexacou, KMGimisis, THayes, JMOikonomakos, NG Naturally Occurring Pentacyclic Triterpenes as Inhibitors of Glycogen Phosphorylase: Synthesis, Structure-Activity Relationships, and X-ray Crystallographic Studies. J Med Chem 51:3540-54 (2008)  
Target
Name:
Glycogen phosphorylase, muscle form
Synonyms:
Glycogen Phosphorylase (PYGM) Glycogen phosphorylase, muscle form PYGM | PYGM_RABIT
Type:
Enzyme
Mol. Mass.:
97296.32
Organism:
Oryctolagus cuniculus (rabbit)
Description:
Phosphorylation of Ser-15 converts phosphorylase B (unphosphorylated) to phosphorylase A.
Residue:
843
  
Inhibitor
Name:
BDBM23200
Synonyms:
(1S,2R,4aS,6aS,6bR,10S,11R,12aR,12bR,14bS)-10,11-dihydroxy-1,2,6a,6b,9,9,12a-heptamethyl-1,2,3,4,4a,5,6,6a,6b,7,8,8a,9,10,11,12,12a,12b,13,14b-icosahydropicene-4a-carboxylic acid pentacyclic triterpene compound 13
Type:
Terpene
Emp. Form.:
C30H48O4
Mol. Mass.:
472.6997
SMILES:
[H][C@@]12[C@@H](C)[C@H](C)CC[C@@]1(CC[C@]1(C)C2=CC[C@]2([H])[C@@]3(C)C[C@@H](O)[C@@H](O)C(C)(C)C3CC[C@@]12C)C(O)=O
:
Substrate
Name:
BDBM23188
Synonyms:
alpha-glucose-1-phosphate glucose-1-phosphate | {[(2R,3R,4S,5S,6R)-3,4,5-trihydroxy-6-(hydroxymethyl)oxan-2-yl]oxy}phosphonic acid
Type:
Emp. Form.:
C6H13O9P
Mol. Mass.:
260.1358
SMILES:
OC[C@H]1O[C@H](OP(O)(O)=O)[C@H](O)[C@@H](O)[C@@H]1O
: