Target
L-lactate dehydrogenase
Ligand
BDBM23227
Substrate
BDBM19473
Meas. Tech.
Lactate Dehydrogenase Inhibition Assay
pH
7±n/a
Temperature
298.15±n/a K
IC50
3130±180 nM
Citation
 Choi, SRPradhan, AHammond, NLChittiboyina, AGTekwani, BLAvery, MA Design, synthesis, and biological evaluation of Plasmodium falciparum lactate dehydrogenase inhibitors. J Med Chem 50:3841-50 (2007)  
Target
Name:
L-lactate dehydrogenase
Synonyms:
L-lactate dehydrogenase Lactate Dehydrogenase | pfLDH
Type:
Oxidoreductase
Mol. Mass.:
34111.90
Organism:
Plasmodium falciparum
Description:
Residue:
316
  
Inhibitor
Name:
BDBM23227
Synonyms:
Oxamic acid derivative, 5 | [(4-{2-[(5-hydroxy-2-{[(4-methoxyphenyl)methyl]carbamoyl}-4-oxo-4H-chromen-7-yl)oxy]ethyl}phenyl)carbamoyl]formic acid
Type:
Small organic molecule
Emp. Form.:
C28H24N2O9
Mol. Mass.:
532.4982
SMILES:
COc1ccc(CNC(=O)c2cc(=O)c3c(O)cc(OCCc4ccc(NC(=O)C(O)=O)cc4)cc3o2)cc1
:
Substrate
Name:
BDBM19473
Synonyms:
2-Oxopropanoate Pyruvate
Type:
Small organic molecule
Emp. Form.:
C3H4O3
Mol. Mass.:
88.0621
SMILES:
CC(=O)C(O)=O
: