Target
Malate dehydrogenase, mitochondrial
Ligand
BDBM23227
Substrate
BDBM23230
Meas. Tech.
Lactate Dehydrogenase Inhibition Assay
IC50
2720±n/a nM
Citation
 Choi, SRPradhan, AHammond, NLChittiboyina, AGTekwani, BLAvery, MA Design, synthesis, and biological evaluation of Plasmodium falciparum lactate dehydrogenase inhibitors. J Med Chem 50:3841-50 (2007)  
Target
Name:
Malate dehydrogenase, mitochondrial
Synonyms:
MDH2 Malate dehydrogenase mitochondrial
Type:
Oxidoreductase; homodimer
Mol. Mass.:
35493.48
Organism:
Sus scrofa (pig)
Description:
Porcine heart mitochondria.
Residue:
337
  
Inhibitor
Name:
BDBM23227
Synonyms:
Oxamic acid derivative, 5 | [(4-{2-[(5-hydroxy-2-{[(4-methoxyphenyl)methyl]carbamoyl}-4-oxo-4H-chromen-7-yl)oxy]ethyl}phenyl)carbamoyl]formic acid
Type:
Small organic molecule
Emp. Form.:
C28H24N2O9
Mol. Mass.:
532.4982
SMILES:
COc1ccc(CNC(=O)c2cc(=O)c3c(O)cc(OCCc4ccc(NC(=O)C(O)=O)cc4)cc3o2)cc1
:
Substrate
Name:
BDBM23230
Synonyms:
2-Oxosuccinic acid Oxaloacetate keto-Oxaloacetate
Type:
Small organic molecule
Emp. Form.:
C4H4O5
Mol. Mass.:
132.0716
SMILES:
OC(=O)CC(=O)C(O)=O
: