Target
L-lactate dehydrogenase B chain
Ligand
BDBM23258
Substrate
BDBM23233
Meas. Tech.
Lactate Dehydrogenase Inhibition Assay
IC50
>200000±n/a nM
Citation
 Cameron, ARead, JTranter, RWinter, VJSessions, RBBrady, RLVivas, LEaston, AKendrick, HCroft, SLBarros, DLavandera, JLMartin, JJRisco, FGarcía-Ochoa, SGamo, FJSanz, LLeon, LRuiz, JRGabarró, RMallo, AGómez de las Heras, F Identification and activity of a series of azole-based compounds with lactate dehydrogenase-directed anti-malarial activity. J Biol Chem 279:31429-39 (2004)  
Target
Name:
L-lactate dehydrogenase B chain
Synonyms:
L-lactate dehydrogenase B LDH heart subunit LDH-H LDHB_HUMAN Renal carcinoma antigen NY-REN-46
Type:
Oxidoreductase; homotetramer
Mol. Mass.:
36635.55
Organism:
Homo sapiens (Human)
Description:
Residue:
334
  
Inhibitor
Name:
BDBM23258
Synonyms:
1H-1,2,3-triazole-5-carboxylic acid | Triazole, TRZ10
Type:
Small organic molecule
Emp. Form.:
C3H3N3O2
Mol. Mass.:
113.0748
SMILES:
OC(=O)c1cnn[nH]1
:
Substrate
Name:
BDBM23233
Synonyms:
2-hydroxypropanoic acid Lactic Acid
Type:
Small organic molecule
Emp. Form.:
C3H6O3
Mol. Mass.:
90.0779
SMILES:
CC(O)C(O)=O
: