Target
Tyrosine-protein kinase JAK2
Ligand
BDBM344024
Substrate
Meas. Tech.
In Vitro Kinase Assay
IC50
<1000±n/a nM
Citation
 Li, YZhu, WMei, SGlenn, J Tricyclic fused thiophene derivatives as JAK inhibitors US Patent  US9908895 Publication Date 3/6/2018 
Target
Name:
Tyrosine-protein kinase JAK2
Synonyms:
JAK-2 JAK2_HUMAN Janus kinase 2 (JAK2) | Janus kinase 2 (a protein tyrosine kinase)
Type:
Protein
Mol. Mass.:
130684.68
Organism:
Homo sapiens (Human)
Description:
O60674
Residue:
1132
  
Inhibitor
Name:
BDBM344024
Synonyms:
US10370387, Example 8 US9777017, Example 8 | US9908895, Example 8
Type:
Small organic molecule
Emp. Form.:
C19H22N4OS
Mol. Mass.:
354.469
SMILES:
C[C@@H](O)c1nc2cnc3ccsc3c2n1[C@H]1CC[C@H](CCC#N)CC1
: