Target
Tyrosine-protein kinase JAK2
Ligand
BDBM375655
Substrate
Meas. Tech.
In Vitro Kinase Assay
IC50
>2000±n/a nM
Citation
 Li, YZhu, WMei, SGlenn, J Tricyclic fused thiophene derivatives as JAK inhibitors US Patent  US9908895 Publication Date 3/6/2018 
Target
Name:
Tyrosine-protein kinase JAK2
Synonyms:
JAK-2 JAK2_HUMAN Janus kinase 2 (JAK2) | Janus kinase 2 (a protein tyrosine kinase)
Type:
Protein
Mol. Mass.:
130684.68
Organism:
Homo sapiens (Human)
Description:
O60674
Residue:
1132
  
Inhibitor
Name:
BDBM375655
Synonyms:
US10370387, Example 30-2 | US9908895, Example 30
Type:
Small organic molecule
Emp. Form.:
C19H23N5OS
Mol. Mass.:
369.484
SMILES:
C[C@@H](O)c1nc2cnc3ccsc3c2n1[C@H]1CCC(CC1)NCCC#N
: