Target
Tyrosine-protein kinase JAK2
Ligand
BDBM344052
Substrate
Meas. Tech.
In Vitro Kinase Assay
IC50
>2000±n/a nM
Citation
 Li, YZhu, WMei, SGlenn, J Tricyclic fused thiophene derivatives as JAK inhibitors US Patent  US9908895 Publication Date 3/6/2018 
Target
Name:
Tyrosine-protein kinase JAK2
Synonyms:
JAK-2 JAK2_HUMAN Janus kinase 2 (JAK2) | Janus kinase 2 (a protein tyrosine kinase)
Type:
Protein
Mol. Mass.:
130684.68
Organism:
Homo sapiens (Human)
Description:
O60674
Residue:
1132
  
Inhibitor
Name:
BDBM344052
Synonyms:
US11161855, Example 36 (second peak) US9908895, Example 36
Type:
Small organic molecule
Emp. Form.:
C18H20N4O2S
Mol. Mass.:
356.442
SMILES:
C[C@@H](O)c1nc2cnc3ccsc3c2n1[C@@H]1CC[C@@H](CC#N)[C@@H](O)C1
: