Target
Tyrosine-protein kinase JAK1
Ligand
BDBM344074
Substrate
Meas. Tech.
In Vitro Kinase Assay
IC50
<100±n/a nM
Citation
 Li, YZhu, WMei, SGlenn, J Tricyclic fused thiophene derivatives as JAK inhibitors US Patent  US9908895 Publication Date 3/6/2018 
Target
Name:
Tyrosine-protein kinase JAK1
Synonyms:
JAK-1 JAK1A JAK1_HUMAN Janus kinase 1 (JAK1) | Janus kinase 1 JAK1
Type:
Protein
Mol. Mass.:
133293.73
Organism:
Homo sapiens (Human)
Description:
P23458
Residue:
1154
  
Inhibitor
Name:
BDBM344074
Synonyms:
US10370387, Example 58 US9777017, Example 58 | US9908895, Example 58
Type:
Small organic molecule
Emp. Form.:
C19H21N5O2S
Mol. Mass.:
383.467
SMILES:
C[C@@H](O)c1nc2cnc3ccsc3c2n1[C@H]1CCCN(C1)C(=O)CCC#N
: