Target
Botulinum neurotoxin type A2 [1-425]
Ligand
BDBM23265
Substrate
SNAPtide
Meas. Tech.
Evaluation of Inhibitors with Recombinant LC/A
pH
7.4±n/a
Temperature
296.15±n/a K
IC50
12500±n/a nM
Citation
 Eubanks, LMHixon, MSJin, WHong, SClancy, CMTepp, WHBaldwin, MRMalizio, CJGoodnough, MCBarbieri, JTJohnson, EABoger, DLDickerson, TJJanda, KD An in vitro and in vivo disconnect uncovered through high-throughput identification of botulinum neurotoxin A antagonists. Proc Natl Acad Sci U S A 104:2602-7 (2007)  
Target
Name:
Botulinum neurotoxin type A2 [1-425]
Synonyms:
BXA2_CLOBJ Botulinum Neurotoxin Type A atx bonT botA
Type:
Metalloprotease
Mol. Mass.:
48687.43
Organism:
Clostridium botulinum
Description:
Recombinant C. botulinum LC/A (1-425) was expressed in E. coli.
Residue:
425
  
Inhibitor
Name:
BDBM23265
Synonyms:
6-ethyl-1-[(4-methylphenyl)methyl]-4-[(2E)-3-phenylprop-2-enoyl]piperazin-2-one | NA-A1B2C10
Type:
Small organic molecule
Emp. Form.:
C23H26N2O2
Mol. Mass.:
362.4647
SMILES:
CCC1CN(CC(=O)N1Cc1ccc(C)cc1)C(=O)C=Cc1ccccc1
:
Substrate
Name:
SNAPtide
Synonyms:
Type:
Fluorogenic Substrate
Mol. Mass.:
358.43
Organism:
Description:
Peptide derived from synaptosomes associated protein, SNAP-25. (U.S. Patent #6504006. List Biological Laboratories, Inc., Campbell, CA.).
Residue:
3
NA