Target
Peptidyl-prolyl cis-trans isomerase FKBP1A
Ligand
BDBM23381
Substrate
BDBM23318
Meas. Tech.
Peptidyl Prolyl Isomerase (PPIase) Inibition Assay
Ki
288±n/a nM
Citation
 Hudack, RABarta, NSGuo, CDeal, JDong, LFay, LKCaprathe, BChatterjee, AVanderpool, DBigge, CShowalter, RBender, SAugelli-Szafran, CELunney, EHou, X Design, synthesis, and biological activity of novel polycyclic aza-amide FKBP12 ligands. J Med Chem 49:1202-6 (2006)  
Target
Name:
Peptidyl-prolyl cis-trans isomerase FKBP1A
Synonyms:
12 kDa FKBP FKB1A_BOVIN FKBP1 Immunophilin FKBP12 Rotamase
Type:
Isomerase
Mol. Mass.:
11911.51
Organism:
Bos taurus (bovine)
Description:
The enzyme was purified from calf thymus. The collected protein was further applied to Sephacryl column, and the fraction contained high PPIase activity was pooled.
Residue:
108
  
Inhibitor
Name:
BDBM23381
Synonyms:
4,6-dimethoxy-17-({4-[(3,4,5-trimethoxyphenyl)amino]benzene}sulfonyl)-11,17-diazatetracyclo[11.3.1.0^{2,11}.0^{3,8}]heptadeca-3(8),4,6-trien-12-one | Tetracyclic aza-amide, 12j
Type:
Small organic molecule
Emp. Form.:
C32H37N3O8S
Mol. Mass.:
623.716
SMILES:
COc1cc2CCN3C(C4CCCC(N4S(=O)(=O)c4ccc(Nc5cc(OC)c(OC)c(OC)c5)cc4)C3=O)c2c(OC)c1
:
Substrate
Name:
BDBM23318
Synonyms:
3-{[(1S)-1-{[(2S)-4-methyl-1-[(2S)-2-{[(1S)-1-[(4-nitrophenyl)carbamoyl]-2-phenylethyl]carbamoyl}pyrrolidin-1-yl]-1-oxopentan-2-yl]carbamoyl}ethyl]carbamoyl}propanoic acid N-succinyl Ala-Leu-Pro-Phe p-nitroanilide | Suc-ALPF-pNA
Type:
Colorimetric substrate
Emp. Form.:
C33H42N6O9
Mol. Mass.:
666.7214
SMILES:
CC(C)C[C@H](NC(=O)[C@H](C)NC(=O)CCC(O)=O)C(=O)N1CCC[C@H]1C(=O)N[C@@H](Cc1ccccc1)C(=O)Nc1ccc(cc1)[N+]([O-])=O
: