Target
Sodium-dependent dopamine transporter
Ligand
BDBM375676
Substrate
Meas. Tech.
Scintillation Proximity Assay
IC50
12.9±n/a nM
Citation
 Cremonesi, SLuker, TSemeraro, TMicheli, F Spirocyclic derivatives US Patent  US9908897 Publication Date 3/6/2018 
Target
Name:
Sodium-dependent dopamine transporter
Synonyms:
DA transporter DAT1 Dopamine transporter protein (DAT) SC6A3_HUMAN Sodium-dependent dopamine transporter Solute carrier family 6 member 3
Type:
Multi-pass membrane protein
Mol. Mass.:
68497.11
Organism:
Homo sapiens (Human)
Description:
Q01959
Residue:
620
  
Inhibitor
Name:
BDBM375676
Synonyms:
US9908897, Example 57
Type:
Small organic molecule
Emp. Form.:
C19H20F4N4O2
Mol. Mass.:
412.3813
SMILES:
Fc1ccccc1Oc1cc(nc(n1)N1CCC2(CC1)CNCCO2)C(F)(F)F
: