Target
Sodium-dependent dopamine transporter
Ligand
BDBM375699
Substrate
Meas. Tech.
Scintillation Proximity Assay
IC50
8.32±n/a nM
Citation
 Cremonesi, SLuker, TSemeraro, TMicheli, F Spirocyclic derivatives US Patent  US9908897 Publication Date 3/6/2018 
Target
Name:
Sodium-dependent dopamine transporter
Synonyms:
DA transporter DAT1 Dopamine transporter protein (DAT) SC6A3_HUMAN Sodium-dependent dopamine transporter Solute carrier family 6 member 3
Type:
Multi-pass membrane protein
Mol. Mass.:
68497.11
Organism:
Homo sapiens (Human)
Description:
Q01959
Residue:
620
  
Inhibitor
Name:
BDBM375699
Synonyms:
US9908897, Example 77
Type:
Small organic molecule
Emp. Form.:
C21H25F4N5O
Mol. Mass.:
439.4497
SMILES:
CN1CCCNCC11CCN(CC1)c1nc(Oc2cccc(F)c2)cc(n1)C(F)(F)F
: