Target
Sodium-dependent serotonin transporter
Ligand
BDBM375704
Substrate
Meas. Tech.
Scintillation Proximity Assay
IC50
10.0±n/a nM
Citation
 Cremonesi, SLuker, TSemeraro, TMicheli, F Spirocyclic derivatives US Patent  US9908897 Publication Date 3/6/2018 
Target
Name:
Sodium-dependent serotonin transporter
Synonyms:
5-HT Transporter 5HTT SC6A4_HUMAN SLC6A4 Serotonin transporter (5HTT) Sodium-dependent serotonin transporter (SERT) | Solute carrier family 6 member 4
Type:
Multi-pass membrane protein
Mol. Mass.:
70322.51
Organism:
Homo sapiens (Human)
Description:
P31645
Residue:
630
  
Inhibitor
Name:
BDBM375704
Synonyms:
US9908897, Example 82
Type:
Small organic molecule
Emp. Form.:
C21H23F3N2O
Mol. Mass.:
376.4153
SMILES:
Fc1cccc(Oc2cc(F)c(F)cc2N2CCC3(CCNCC3)CC2)c1
: