Target
Histone deacetylase 1
Ligand
BDBM375743
Substrate
Meas. Tech.
Enzyme Inhibition
IC50
<1000±n/a nM
Citation
 Jacques, VRusche, JRPeet, NPSingh, J Histone deacetylase inhibitors US Patent  US9908899 Publication Date 3/6/2018 
Target
Name:
Histone deacetylase 1
Synonyms:
Cereblon/Histone deacetylase 1 HDAC1 Histone deacetylase 1 (HDAC1) RPD3L1
Type:
Enzyme
Mol. Mass.:
55090.27
Organism:
Homo sapiens (Human)
Description:
Q13547
Residue:
482
  
Inhibitor
Name:
BDBM375743
Synonyms:
US10301323, Compound D11 | US9908899, Compound D11
Type:
Small organic molecule
Emp. Form.:
C22H22N4O
Mol. Mass.:
358.4363
SMILES:
Nc1ccccc1NC(=O)\C=C\c1cnn(CC\C=C\c2ccccc2)c1
: