Target
Histone deacetylase 1
Ligand
BDBM375744
Substrate
Meas. Tech.
Enzyme Inhibition
IC50
<1000±n/a nM
Citation
 Jacques, VRusche, JRPeet, NPSingh, J Histone deacetylase inhibitors US Patent  US9908899 Publication Date 3/6/2018 
Target
Name:
Histone deacetylase 1
Synonyms:
Cereblon/Histone deacetylase 1 HDAC1 Histone deacetylase 1 (HDAC1) RPD3L1
Type:
Enzyme
Mol. Mass.:
55090.27
Organism:
Homo sapiens (Human)
Description:
Q13547
Residue:
482
  
Inhibitor
Name:
BDBM375744
Synonyms:
US10301323, Compound D5 | US9908899, Compound D5
Type:
Small organic molecule
Emp. Form.:
C19H17FN4O
Mol. Mass.:
336.3629
SMILES:
Nc1ccccc1NC(=O)\C=C\c1cnn(Cc2ccc(F)cc2)c1
: