Target
Histone deacetylase 1
Ligand
BDBM375770
Substrate
Meas. Tech.
Enzyme Inhibition
IC50
<1000±n/a nM
Citation
 Jacques, VRusche, JRPeet, NPSingh, J Histone deacetylase inhibitors US Patent  US9908899 Publication Date 3/6/2018 
Target
Name:
Histone deacetylase 1
Synonyms:
Cereblon/Histone deacetylase 1 HDAC1 Histone deacetylase 1 (HDAC1) RPD3L1
Type:
Enzyme
Mol. Mass.:
55090.27
Organism:
Homo sapiens (Human)
Description:
Q13547
Residue:
482
  
Inhibitor
Name:
BDBM375770
Synonyms:
US10301323, Compound F4 | US9908899, Compound F4
Type:
Small organic molecule
Emp. Form.:
C26H26N4O
Mol. Mass.:
410.5108
SMILES:
Nc1ccccc1NC(=O)c1ccc(CC2CN(Cc3ccc4cc[nH]c4c3)C2)cc1
: