Target
Histone deacetylase 2
Ligand
BDBM375771
Substrate
Meas. Tech.
Enzyme Inhibition
IC50
3000±n/a nM
Citation
 Jacques, VRusche, JRPeet, NPSingh, J Histone deacetylase inhibitors US Patent  US9908899 Publication Date 3/6/2018 
Target
Name:
Histone deacetylase 2
Synonyms:
Cereblon/Histone deacetylase 2 HDAC2 Histone deacetylase 2 (HDAC2) | Human HDAC2
Type:
Chromatin regulator; hydrolase; repressor
Mol. Mass.:
55356.54
Organism:
Homo sapiens (Human)
Description:
Q92769
Residue:
488
  
Inhibitor
Name:
BDBM375771
Synonyms:
US10301323, Compound F5 | US9908899, Compound F5
Type:
Small organic molecule
Emp. Form.:
C26H23ClN4O
Mol. Mass.:
442.94
SMILES:
Nc1ccccc1NC(=O)c1ccc(C=C2CN(Cc3ccc4cc[nH]c4c3)C2)c(Cl)c1
: