Target
Disintegrin and metalloproteinase domain-containing protein 17 [215-477,S266A,N452Q]
Ligand
BDBM23482
Substrate
BDBM23453
Meas. Tech.
TACE Inhibition Assay
pH
7.3±n/a
Temperature
295.15±n/a K
Ki
9±n/a nM
Citation
 Zhu, ZMazzola, RSinning, LMcKittrick, BNiu, XLundell, DSun, JOrth, PGuo, ZMadison, VIngram, RBeyer, BM Discovery of novel hydroxamates as highly potent tumor necrosis factor-alpha converting enzyme inhibitors: Part I--discovery of two binding modes. J Med Chem 51:725-36 (2008)  
Target
Name:
Disintegrin and metalloproteinase domain-containing protein 17 [215-477,S266A,N452Q]
Synonyms:
A disintegrin and metalloproteinase domain 17 ADAM 17 CD156b antigen Snake venom-like protease TNF-alpha-Converting Enzyme
Type:
Single-pass type I membrane protein; metalloprotease
Mol. Mass.:
29695.98
Organism:
Homo sapiens (Human)
Description:
The catalytic domain of recombinant human TNF-converting enzyme (residues 215-477) with two mutations (S266A and N452Q) and a 6xHis was purified from the baculovirus/Hi5 cells expression system.
Residue:
263
  
Inhibitor
Name:
BDBM23482
Synonyms:
(1R,2R)-1-N-cyclohexyl-2-N-hydroxy-1-{3-[(2-methylquinolin-4-yl)methoxy]phenyl}cyclopropane-1,2-dicarboxamide | hydroxamate deriv., 74
Type:
Small organic molecule
Emp. Form.:
C28H31N3O4
Mol. Mass.:
473.5634
SMILES:
Cc1cc(COc2cccc(c2)[C@]2(C[C@H]2C(=O)NO)C(=O)NC2CCCCC2)c2ccccc2n1
:
Substrate
Name:
BDBM23453
Synonyms:
MCA-Pro-Leu-Ala-Gln-Ala-Val-Arg-Ser-Ser-Ser-Dpa-Arg-NH2. MCA, (7-methoxycoumarin-4-yl)acetyl. Dpa, N-3-(2,4-dinitrophenyl)-L-2,3-diaminopropionyl. | TACE substrate peptide
Type:
Internally quenched peptide
Emp. Form.:
Mol. Mass.:
SMILES:
: