Target
Vascular endothelial growth factor receptor 2
Ligand
BDBM50020234
Substrate
Meas. Tech.
Enzyme Assay
IC50
9.70±n/a nM
Citation
 Duan, WDing, JLv, YXie, H Naphthylamide compound, preparation method and use thereof US Patent  US9914707 Publication Date 3/13/2018 
Target
Name:
Vascular endothelial growth factor receptor 2
Synonyms:
CD_antigen=CD309 Fetal liver kinase 1 (FLK-1) KDR Protein-tyrosine kinase receptor Flk-1 VEGFR-2 VEGFR2 Vascular Endothelial Growth Factor Receptor Kinase 2 Vascular endothelial growth factor receptor 2 (KDR) Vascular endothelial growth factor receptor 2 (VEGFR2) Vascular endothelial growth factor receptor-2 (VEGFR-2)
Type:
Receptor Tyrosine Kinase
Mol. Mass.:
151510.97
Organism:
Homo sapiens (Human)
Description:
P35968
Residue:
1356
  
Inhibitor
Name:
BDBM50020234
Synonyms:
CHEMBL3288520 | US9914707, I-24
Type:
Small organic molecule
Emp. Form.:
C22H17N5O2
Mol. Mass.:
383.4027
SMILES:
Cc1cc(NC(=O)c2cccc3cc(ccc23)-c2cccc3[nH]nc(N)c23)no1
: