Target
Disintegrin and metalloproteinase domain-containing protein 17
Ligand
BDBM23501
Substrate
pro-TNF-alpha peptide
Meas. Tech.
TACE Inhibition Assay
pH
7.4±n/a
Temperature
295.15±n/a K
IC50
2±1 nM
Citation
 Huang, AJoseph-McCarthy, DLovering, FSun, LWang, WXu, WZhu, YCui, JZhang, YLevin, JI Structure-based design of TACE selective inhibitors: manipulations in the S1'-S3' pocket. Bioorg Med Chem 15:6170-81 (2007)  
Target
Name:
Disintegrin and metalloproteinase domain-containing protein 17
Synonyms:
ADA17_HUMAN CSVP Disintegrin and metalloproteinase domain-containing protein 17 (ADAM17) TNF-alpha convertase TNF-alpha-converting enzyme (TACE) Tumor necrosis factor-α converting enzyme (TACE)
Type:
Enzyme
Mol. Mass.:
93007.89
Organism:
Homo sapiens (Human)
Description:
Residue:
824
  
Inhibitor
Name:
BDBM23501
Synonyms:
BMCL193445 Compound 2d tert-butyl 4-({[4-(but-2-yn-1-yloxy)benzene]sulfonyl}methyl)-4-(hydroxycarbamoyl)piperidine-1-carboxylate
Type:
Small organic molecule
Emp. Form.:
C22H30N2O7S
Mol. Mass.:
466.548
SMILES:
CC#CCOc1ccc(cc1)S(=O)(=O)CC1(CCN(CC1)C(=O)OC(C)(C)C)C(=O)NO
:
Substrate
Name:
pro-TNF-alpha peptide
Synonyms:
Type:
Fluorogenic peptide
Mol. Mass.:
1429.56
Organism:
Description:
A proprietary synthetic peptide of pro-TNF-alpha containing the minimal TACE cleavage sequence.
Residue:
14
ALAQAVRSSSRDPA