Target
2-amino-3-carboxymuconate-6-semialdehyde decarboxylase
Ligand
BDBM261535
Substrate
Meas. Tech.
ACMSD1 Inhibition Assay
IC50
77.0±n/a nM
Citation
 Pellicciari, RAuwerx, JRaffaelli, N Inhibitors of α-amino-β-carboxymuconic acid semialdehyde decarboxylase US Patent  US9708272 Publication Date 7/18/2017 
Target
Name:
2-amino-3-carboxymuconate-6-semialdehyde decarboxylase
Synonyms:
ACMSD Picolinate carboxylase
Type:
Enzyme Catalytic Domain
Mol. Mass.:
38037.38
Organism:
Homo sapiens (Human)
Description:
Q8TDX5
Residue:
336
  
Inhibitor
Name:
BDBM261535
Synonyms:
US10513499, Compound 6 US9708272, 6
Type:
Small organic molecule
Emp. Form.:
C19H19N3O3S
Mol. Mass.:
369.437
SMILES:
OC(=O)c1cccc(CSc2nc(C3CCCCC3)c(C#N)c(=O)[nH]2)c1
: