Target
Hepatocyte growth factor receptor
Ligand
BDBM375781
Substrate
Meas. Tech.
C-MET Kinase Assay
IC50
<10±n/a nM
Citation
 Hudkins, RLZulli, AL Pyrazolo[1,5-a]pyridine derivatives and methods of their use US Patent  US9914731 Publication Date 3/13/2018 
Target
Name:
Hepatocyte growth factor receptor
Synonyms:
Hepatocyte growth factor receptor Hepatocyte growth factor receptor (c-MET) MET Met proto-oncogene (hepatocyte growth factor receptor) Tyrosine-protein kinase Met (c-Met) c-Met kinase
Type:
Protein
Mol. Mass.:
155559.73
Organism:
Homo sapiens (Human)
Description:
P08581
Residue:
1390
  
Inhibitor
Name:
BDBM375781
Synonyms:
US9914731, Ex. No. 5
Type:
Small organic molecule
Emp. Form.:
C24H18F2N4O3
Mol. Mass.:
448.4215
SMILES:
Fc1ccc(NC(=O)C2(CC2)C(=O)Nc2ccc(Oc3cccn4nccc34)c(F)c2)cc1
: