Target
Hepatocyte growth factor receptor
Ligand
BDBM375844
Substrate
Meas. Tech.
C-MET Kinase Assay
IC50
<10±n/a nM
Citation
 Hudkins, RLZulli, AL Pyrazolo[1,5-a]pyridine derivatives and methods of their use US Patent  US9914731 Publication Date 3/13/2018 
Target
Name:
Hepatocyte growth factor receptor
Synonyms:
Hepatocyte growth factor receptor Hepatocyte growth factor receptor (c-MET) MET Met proto-oncogene (hepatocyte growth factor receptor) Tyrosine-protein kinase Met (c-Met) c-Met kinase
Type:
Protein
Mol. Mass.:
155559.73
Organism:
Homo sapiens (Human)
Description:
P08581
Residue:
1390
  
Inhibitor
Name:
BDBM375844
Synonyms:
US9914731, Ex. No. 66
Type:
Small organic molecule
Emp. Form.:
C31H27F2N5O5
Mol. Mass.:
587.5734
SMILES:
CCOc1ccn(-c2ccc(F)cc2)c(=O)c1C(=O)Nc1ccc(Oc2cc(cn3nccc23)N2CCOCC2)c(F)c1
: