Target
Tyrosine-protein kinase SYK
Ligand
BDBM375953
Substrate
Meas. Tech.
GSK Kinase Assay
IC50
12.8±n/a nM
Citation
 Dahmann, GHoffmann, MKlicic, JLamb, DJMcCarthy, CNapier, SCParrish, KScott, JFitzgerald, JLWalker, E Heteroaryl Syk inhibitors US Patent  US9914735 Publication Date 3/13/2018 
Target
Name:
Tyrosine-protein kinase SYK
Synonyms:
KSYK_HUMAN Spleen Tyrosine Kinase Tyrosine-protein kinase SYK (Syk)
Type:
Enzyme
Mol. Mass.:
72079.99
Organism:
Homo sapiens (Human)
Description:
P43405
Residue:
635
  
Inhibitor
Name:
BDBM375953
Synonyms:
US10947243, Example 22 | US9914735, Example 22
Type:
Small organic molecule
Emp. Form.:
C24H28N4O3
Mol. Mass.:
420.5041
SMILES:
C[C@@H](Oc1cc(cc2nn(C)cc12)-c1ccc(cc1)N1CCOCC1)[C@H]1CNC(=O)C1
: