Target
High affinity nerve growth factor receptor
Ligand
BDBM376019
Substrate
Meas. Tech.
DiscoverX PathHunter Assay
IC50
150±n/a nM
Citation
 Mitchell, HFraley, MECooke, AJStump, CAZhang, XMcComas, CCSchirripa, KMcWherter, MLiu, PParker, DLi, CSMao, Q TrKA kinase inhibitors, compositions and methods thereof US Patent  US9914736 Publication Date 3/13/2018 
Target
Name:
High affinity nerve growth factor receptor
Synonyms:
2.7.10.1 NTRK1 NTRK1_HUMAN Neurotrophic tyrosine kinase receptor type 1 Synonyms=MTC TRK1-transforming tyrosine kinase protein TRKA GN Tropomyosin alpha-3 chain/High affinity nerve growth factor receptor Tropomyosin-related kinase A (TrkA) Tyrosine kinase receptor (Trk) Tyrosine kinase receptor A (Trk A) Tyrosine kinase receptor A (TrkA) p140-TrkA
Type:
Mol. Mass.:
87498.18
Organism:
Homo sapiens (Human)
Description:
P04629
Residue:
796
  
Inhibitor
Name:
BDBM376019
Synonyms:
N-(3-methyl-1-phenyl-1H- 1,2,4-triazol-5-yl)-3-(1- methyl-1H-pyrazol-3-yl)-4- (trifluoromethyl)benzamide | US9914736, Compound 15
Type:
Small organic molecule
Emp. Form.:
C21H17F3N6O
Mol. Mass.:
426.3945
SMILES:
Cc1nc(NC(=O)c2ccc(c(c2)-c2ccn(C)n2)C(F)(F)F)n(n1)-c1ccccc1
: