Target
High affinity nerve growth factor receptor
Ligand
BDBM376066
Substrate
Meas. Tech.
DiscoverX PathHunter Assay
IC50
85.0±n/a nM
Citation
 Mitchell, HFraley, MECooke, AJStump, CAZhang, XMcComas, CCSchirripa, KMcWherter, MLiu, PParker, DLi, CSMao, Q TrKA kinase inhibitors, compositions and methods thereof US Patent  US9914736 Publication Date 3/13/2018 
Target
Name:
High affinity nerve growth factor receptor
Synonyms:
2.7.10.1 NTRK1 NTRK1_HUMAN Neurotrophic tyrosine kinase receptor type 1 Synonyms=MTC TRK1-transforming tyrosine kinase protein TRKA GN Tropomyosin alpha-3 chain/High affinity nerve growth factor receptor Tropomyosin-related kinase A (TrkA) Tyrosine kinase receptor (Trk) Tyrosine kinase receptor A (Trk A) Tyrosine kinase receptor A (TrkA) p140-TrkA
Type:
Mol. Mass.:
87498.18
Organism:
Homo sapiens (Human)
Description:
P04629
Residue:
796
  
Inhibitor
Name:
BDBM376066
Synonyms:
2-fluoro-N-(5-phenyl-1H- pyrazol-4-yl)-5-(1H-pyrazol-3- yl)-4- (trifluoromethyl)benzamide | US9914736, Compound 62
Type:
Small organic molecule
Emp. Form.:
C20H13F4N5O
Mol. Mass.:
415.3437
SMILES:
Fc1cc(c(cc1C(=O)Nc1cn[nH]c1-c1ccccc1)-c1cc[nH]n1)C(F)(F)F
: