Target
High affinity nerve growth factor receptor
Ligand
BDBM376090
Substrate
Meas. Tech.
DiscoverX PathHunter Assay
IC50
7.00±n/a nM
Citation
 Mitchell, HFraley, MECooke, AJStump, CAZhang, XMcComas, CCSchirripa, KMcWherter, MLiu, PParker, DLi, CSMao, Q TrKA kinase inhibitors, compositions and methods thereof US Patent  US9914736 Publication Date 3/13/2018 
Target
Name:
High affinity nerve growth factor receptor
Synonyms:
2.7.10.1 NTRK1 NTRK1_HUMAN Neurotrophic tyrosine kinase receptor type 1 Synonyms=MTC TRK1-transforming tyrosine kinase protein TRKA GN Tropomyosin alpha-3 chain/High affinity nerve growth factor receptor Tropomyosin-related kinase A (TrkA) Tyrosine kinase receptor (Trk) Tyrosine kinase receptor A (Trk A) Tyrosine kinase receptor A (TrkA) p140-TrkA
Type:
Mol. Mass.:
87498.18
Organism:
Homo sapiens (Human)
Description:
P04629
Residue:
796
  
Inhibitor
Name:
BDBM376090
Synonyms:
5-(2-fluoro-5-(pyrimidin-2-yl)- 4- (trifluoromethyl)benzamido)- 1-(4-fluorophenyl)-N-methyl- 1H-pyrazole-3-carboxamide | US9914736, Compound 86
Type:
Small organic molecule
Emp. Form.:
C23H15F5N6O2
Mol. Mass.:
502.3962
SMILES:
CNC(=O)c1cc(NC(=O)c2cc(-c3ncccn3)c(cc2F)C(F)(F)F)n(n1)-c1ccc(F)cc1
: