Target
High affinity nerve growth factor receptor
Ligand
BDBM376091
Substrate
Meas. Tech.
DiscoverX PathHunter Assay
IC50
6.60±n/a nM
Citation
 Mitchell, HFraley, MECooke, AJStump, CAZhang, XMcComas, CCSchirripa, KMcWherter, MLiu, PParker, DLi, CSMao, Q TrKA kinase inhibitors, compositions and methods thereof US Patent  US9914736 Publication Date 3/13/2018 
Target
Name:
High affinity nerve growth factor receptor
Synonyms:
2.7.10.1 NTRK1 NTRK1_HUMAN Neurotrophic tyrosine kinase receptor type 1 Synonyms=MTC TRK1-transforming tyrosine kinase protein TRKA GN Tropomyosin alpha-3 chain/High affinity nerve growth factor receptor Tropomyosin-related kinase A (TrkA) Tyrosine kinase receptor (Trk) Tyrosine kinase receptor A (Trk A) Tyrosine kinase receptor A (TrkA) p140-TrkA
Type:
Mol. Mass.:
87498.18
Organism:
Homo sapiens (Human)
Description:
P04629
Residue:
796
  
Inhibitor
Name:
BDBM376091
Synonyms:
N-(3-((1H-pyrazol-1- yl)methyl)-1-(4-fluorophenyl)- 1H-pyrazol-5-yl)-2-fluoro-5- (pyrimidin-2-yl)-4- (trifluoromethyl)benzamide | US9914736, Compound 87
Type:
Small organic molecule
Emp. Form.:
C25H16F5N7O
Mol. Mass.:
525.4329
SMILES:
Fc1ccc(cc1)-n1nc(Cn2cccn2)cc1NC(=O)c1cc(-c2ncccn2)c(cc1F)C(F)(F)F
: