Target
Rho-associated protein kinase 2
Ligand
BDBM376303
Substrate
Meas. Tech.
In Vitro Assay
IC50
1.70±n/a nM
Citation
 Quan, MLHu, ZWang, CPatil, S Tricyclic pyrido-carboxamide derivatives as rock inhibitors US Patent  US9914740 Publication Date 3/13/2018 
Target
Name:
Rho-associated protein kinase 2
Synonyms:
KIAA0619 ROCK2 Rho kinase 2 (ROCKII) Rho-associated protein kinase 2 (ROCK2) Rho-associated protein kinase 2/Transforming protein RhoA Rho-associated, coiled-coil-containing protein kinase II p164 ROCK-2
Type:
Protein
Mol. Mass.:
160885.43
Organism:
Homo sapiens (Human)
Description:
O75116
Residue:
1388
  
Inhibitor
Name:
BDBM376303
Synonyms:
US9914740, III-3
Type:
Small organic molecule
Emp. Form.:
C22H19N3O3
Mol. Mass.:
373.4046
SMILES:
CNC(=O)c1cccc(CNC(=O)c2ccc-3c(OCc4cnccc-34)c2)c1
: