Target
Rho-associated protein kinase 2
Ligand
BDBM376377
Substrate
Meas. Tech.
In Vitro Assay
IC50
1.99±n/a nM
Citation
 Quan, MLHu, ZWang, CPatil, S Tricyclic pyrido-carboxamide derivatives as rock inhibitors US Patent  US9914740 Publication Date 3/13/2018 
Target
Name:
Rho-associated protein kinase 2
Synonyms:
KIAA0619 ROCK2 Rho kinase 2 (ROCKII) Rho-associated protein kinase 2 (ROCK2) Rho-associated protein kinase 2/Transforming protein RhoA Rho-associated, coiled-coil-containing protein kinase II p164 ROCK-2
Type:
Protein
Mol. Mass.:
160885.43
Organism:
Homo sapiens (Human)
Description:
O75116
Residue:
1388
  
Inhibitor
Name:
BDBM376377
Synonyms:
US9914740, VIII-3 US9914740, XI-21
Type:
Small organic molecule
Emp. Form.:
C27H29N3O4
Mol. Mass.:
459.5369
SMILES:
CCC1Oc2cnccc2-c2ccc(cc12)C(=O)NCc1cccc(c1)C(=O)NCC(C)(C)O
: