Target
3-oxoacyl-[acyl-carrier-protein] synthase 3
Ligand
BDBM23594
Substrate
BDBM3158
Meas. Tech.
FabD/FabH Coupled Assay
IC50
110±n/a nM
Citation
 Nie, ZPerretta, CLu, JSu, YMargosiak, SGajiwala, KSCortez, JNikulin, VYager, KMAppelt, KChu, S Structure-based design, synthesis, and study of potent inhibitors of beta-ketoacyl-acyl carrier protein synthase III as potential antimicrobial agents. J Med Chem 48:1596-609 (2005)  
Target
Name:
3-oxoacyl-[acyl-carrier-protein] synthase 3
Synonyms:
3-oxoacyl-[acyl-carrier-protein] synthase 3 Beta-ketoacyl-ACP synthase III KAS III fabH
Type:
Acyltransferase; homodimer
Mol. Mass.:
35176.53
Organism:
Enterococcus faecalis
Description:
The E. faecalis FabH was cloned, and protein was expressed in E. coli.
Residue:
321
  
Inhibitor
Name:
BDBM23594
Synonyms:
(3-Phenoxybenzoylamino)benzoic acid deriv., 24b | 2-{[3-phenoxy-4-(pyridin-3-yl)benzene]amido}benzoic acid
Type:
Small organic molecule
Emp. Form.:
C25H18N2O4
Mol. Mass.:
410.4214
SMILES:
OC(=O)c1ccccc1NC(=O)c1ccc(c(Oc2ccccc2)c1)-c1cccnc1
:
Substrate
Name:
BDBM3158
Synonyms:
2-{[2,6-dihydroxy-4-({[(4S)-3-[(4-hydroxybenzene)amido]-1-azabicyclo[3.2.2]nonan-4-yl]oxy}carbonyl)phenyl]carbonyl}-3-hydroxybenzoic acid | Balanol analog 24
Type:
Small organic molecule
Emp. Form.:
C30H28N2O10
Mol. Mass.:
576.5507
SMILES:
OC(=O)c1cccc(O)c1C(=O)c1c(O)cc(cc1O)C(=O)O[C@H]1C2CC[N@@](CC2)CC1NC(=O)c1ccc(O)cc1
: