Target
Beta-secretase 1 [1-460]
Ligand
BDBM136800
Substrate
Meas. Tech.
FRET Assay
IC50
0.700±n/a nM
Citation
 Csjernyik, GKarlstrom, SKers, AKolmodin, KNylof, MOhberg, LRakos, LSandberg, LSehgelmeble, FSoderman, PSwahn, BVon Berg, S Compounds and their use as BACE inhibitors US Patent  US9918985 Publication Date 3/20/2018 
Target
Name:
Beta-secretase 1 [1-460]
Synonyms:
BACE BACE1_HUMAN Beta-secretase 1 (aa 1-460) | KIAA1149
Type:
Protein
Mol. Mass.:
50987.78
Organism:
Homo sapiens (Human)
Description:
P56817[1-460]
Residue:
460
  
Inhibitor
Name:
BDBM136800
Synonyms:
US10231967, Example 48-Isomer-5 US9918985, Example 48 Isomer 1
Type:
Small organic molecule
Emp. Form.:
C23H24ClN3O2
Mol. Mass.:
409.909
SMILES:
CC1=N[C@]2(C[C@H](Oc3ccc(cc23)-c2cccc(Cl)c2)[C@@H]2CCCOC2)N=C1N
: