Target
Beta-secretase 1 [1-460]
Ligand
BDBM136947
Substrate
Meas. Tech.
FRET Assay
IC50
6.10±n/a nM
Citation
 Csjernyik, GKarlstrom, SKers, AKolmodin, KNylof, MOhberg, LRakos, LSandberg, LSehgelmeble, FSoderman, PSwahn, BVon Berg, S Compounds and their use as BACE inhibitors US Patent  US9918985 Publication Date 3/20/2018 
Target
Name:
Beta-secretase 1 [1-460]
Synonyms:
BACE BACE1_HUMAN Beta-secretase 1 (aa 1-460) | KIAA1149
Type:
Protein
Mol. Mass.:
50987.78
Organism:
Homo sapiens (Human)
Description:
P56817[1-460]
Residue:
460
  
Inhibitor
Name:
BDBM136947
Synonyms:
US10231967, Example 96 US9918985, Example 97 Isomer 2
Type:
Small organic molecule
Emp. Form.:
C27H30N4O2
Mol. Mass.:
442.5527
SMILES:
COCc1cc(cc(c1)-c1ccc2C[C@@]3(CC[C@@H](CC3)OC)C3(N=C(C)C(N)=N3)c2c1)C#N
: