Target
Beta-secretase 1 [1-460]
Ligand
BDBM136861
Substrate
Meas. Tech.
FRET Assay
IC50
1.50±n/a nM
Citation
 Csjernyik, GKarlstrom, SKers, AKolmodin, KNylof, MOhberg, LRakos, LSandberg, LSehgelmeble, FSoderman, PSwahn, BVon Berg, S Compounds and their use as BACE inhibitors US Patent  US9918985 Publication Date 3/20/2018 
Target
Name:
Beta-secretase 1 [1-460]
Synonyms:
BACE BACE1_HUMAN Beta-secretase 1 (aa 1-460) | KIAA1149
Type:
Protein
Mol. Mass.:
50987.78
Organism:
Homo sapiens (Human)
Description:
P56817[1-460]
Residue:
460
  
Inhibitor
Name:
BDBM136861
Synonyms:
US10231967, Example 98 US9918985, Example 98
Type:
Small organic molecule
Emp. Form.:
C25H28FN3O2
Mol. Mass.:
421.5071
SMILES:
CO[C@H]1CC[C@@]2(Cc3ccc(cc3[C@@]22N=C(C)C(N)=N2)-c2cc(OC)ccc2F)CC1
: