Target
Beta-secretase 1 [1-460]
Ligand
BDBM136911
Substrate
Meas. Tech.
FRET Assay
IC50
25.0±n/a nM
Citation
 Csjernyik, GKarlstrom, SKers, AKolmodin, KNylof, MOhberg, LRakos, LSandberg, LSehgelmeble, FSoderman, PSwahn, BVon Berg, S Compounds and their use as BACE inhibitors US Patent  US9918985 Publication Date 3/20/2018 
Target
Name:
Beta-secretase 1 [1-460]
Synonyms:
BACE BACE1_HUMAN Beta-secretase 1 (aa 1-460) | KIAA1149
Type:
Protein
Mol. Mass.:
50987.78
Organism:
Homo sapiens (Human)
Description:
P56817[1-460]
Residue:
460
  
Inhibitor
Name:
BDBM136911
Synonyms:
US10231967, Example 133 US9918985, Example 133
Type:
Small organic molecule
Emp. Form.:
C24H27ClN4O
Mol. Mass.:
422.95
SMILES:
CCO[C@H]1CC[C@@]2(Cc3ccc(cc3C22N=C(C)C(N)=N2)-c2cncc(Cl)c2)CC1
: