Target
Bromodomain-containing protein 4
Ligand
BDBM376548
Substrate
Meas. Tech.
AlphaScreen Assay
IC50
<100±n/a nM
Citation
 Yue, EWCombs, APDouty, B Substituted pyrrolo[2,3-c]pyridines and pyrazolo[3,4-c]pyridines as BET protein inhibitors US Patent  US9918990 Publication Date 3/20/2018 
Target
Name:
Bromodomain-containing protein 4
Synonyms:
BRD4 Bromodomain-containing protein 4 (BRD4) Protein HUNK1
Type:
Protein
Mol. Mass.:
152264.84
Organism:
Homo sapiens (Human)
Description:
O60885
Residue:
1362
  
Inhibitor
Name:
BDBM376548
Synonyms:
US9918990, Example 9
Type:
Small organic molecule
Emp. Form.:
C21H15F2N5O2
Mol. Mass.:
407.3729
SMILES:
Cn1nnc2c(Oc3ccc(F)cc3F)c(ccc12)-c1cn(C)c(=O)c2[nH]ccc12
: