Target
Bromodomain-containing protein 4
Ligand
BDBM376556
Substrate
Meas. Tech.
AlphaScreen Assay
IC50
<100±n/a nM
Citation
 Yue, EWCombs, APDouty, B Substituted pyrrolo[2,3-c]pyridines and pyrazolo[3,4-c]pyridines as BET protein inhibitors US Patent  US9918990 Publication Date 3/20/2018 
Target
Name:
Bromodomain-containing protein 4
Synonyms:
BRD4 Bromodomain-containing protein 4 (BRD4) Protein HUNK1
Type:
Protein
Mol. Mass.:
152264.84
Organism:
Homo sapiens (Human)
Description:
O60885
Residue:
1362
  
Inhibitor
Name:
BDBM376556
Synonyms:
US9918990, Example 17
Type:
Small organic molecule
Emp. Form.:
C26H24F2N6O3
Mol. Mass.:
506.504
SMILES:
Cn1cc(-c2ccc3n(CCN4CCOCC4)cnc3c2Oc2ccc(F)cc2F)c2cn[nH]c2c1=O
: