Target
Bromodomain-containing protein 2
Ligand
BDBM376579
Substrate
Meas. Tech.
AlphaScreen Assay
IC50
<100±n/a nM
Citation
 Yue, EWCombs, APDouty, B Substituted pyrrolo[2,3-c]pyridines and pyrazolo[3,4-c]pyridines as BET protein inhibitors US Patent  US9918990 Publication Date 3/20/2018 
Target
Name:
Bromodomain-containing protein 2
Synonyms:
BRD2 Bromodomain and extra-terminal motif (BET) Bromodomain-containing protein 2 (BRD2) RING3
Type:
Protein
Mol. Mass.:
88085.95
Organism:
Homo sapiens (Human)
Description:
P25440
Residue:
801
  
Inhibitor
Name:
BDBM376579
Synonyms:
1-Methyl-5-(6-methyl-7-oxo-6,7-dihydro- 1H-pyrrolo[2,3-c]pyridin-4-yl)-4-phenoxy- 1,3-dihydro-2H-benzimidazol-2-one | US9918990, Example 38
Type:
Small organic molecule
Emp. Form.:
C22H18N4O3
Mol. Mass.:
386.4033
SMILES:
Cn1c2ccc(c(Oc3ccccc3)c2[nH]c1=O)-c1cn(C)c(=O)c2[nH]ccc12
: