Target
Bromodomain-containing protein 4
Ligand
BDBM376657
Substrate
Meas. Tech.
AlphaScreen Assay
IC50
<100±n/a nM
Citation
 Yue, EWCombs, APDouty, B Substituted pyrrolo[2,3-c]pyridines and pyrazolo[3,4-c]pyridines as BET protein inhibitors US Patent  US9918990 Publication Date 3/20/2018 
Target
Name:
Bromodomain-containing protein 4
Synonyms:
BRD4 Bromodomain-containing protein 4 (BRD4) Protein HUNK1
Type:
Protein
Mol. Mass.:
152264.84
Organism:
Homo sapiens (Human)
Description:
O60885
Residue:
1362
  
Inhibitor
Name:
BDBM376657
Synonyms:
US9918990, Example 104
Type:
Small organic molecule
Emp. Form.:
C24H20N4O4
Mol. Mass.:
428.44
SMILES:
CC(=O)NCc1nc2c(Oc3ccccc3)c(ccc2o1)-c1cn(C)c(=O)c2[nH]ccc12
: