Target
MAP kinase-interacting serine/threonine-protein kinase 1
Ligand
BDBM181380
Substrate
Meas. Tech.
MNK1 In Vitro Kinase Assay
pH
7.5±n/a
IC50
34.0±n/a nM
Comments
extracted
Citation
 Blum, AGottschling, DHeckel, AHehn, JPSchmid, BWiedenmayer, D Sulfoximine substituted quinazolines for pharmaceutical compositions US Patent  US9708274 Publication Date 7/18/2017 
Target
Name:
MAP kinase-interacting serine/threonine-protein kinase 1
Synonyms:
MAP Kinase-Interacting Protein Kinase (MNK1) MAP kinase-interacting serine/threonine-protein kinase 1 (MnK1) MAP-kinase interacting kinase 1 (MNK1) MKNK1 MNK1
Type:
Serine/threonine-protein kinase
Mol. Mass.:
51342.85
Organism:
Homo sapiens (Human)
Description:
Q9BUB5
Residue:
465
  
Inhibitor
Name:
BDBM181380
Synonyms:
US9139577, 1.011 | US9708274, 1.011
Type:
Small organic molecule
Emp. Form.:
C22H23F3N4O2S
Mol. Mass.:
464.504
SMILES:
Cc1cc(cc2ncnc(Nc3ccc(F)cc3OC(CF)CF)c12)N=S1(=O)CCCC1
: