Target
MAP kinase-interacting serine/threonine-protein kinase 1
Ligand
BDBM181388
Substrate
Meas. Tech.
MNK1 In Vitro Kinase Assay
pH
7.5±n/a
IC50
54.0±n/a nM
Comments
extracted
Citation
 Blum, AGottschling, DHeckel, AHehn, JPSchmid, BWiedenmayer, D Sulfoximine substituted quinazolines for pharmaceutical compositions US Patent  US9708274 Publication Date 7/18/2017 
Target
Name:
MAP kinase-interacting serine/threonine-protein kinase 1
Synonyms:
MAP Kinase-Interacting Protein Kinase (MNK1) MAP kinase-interacting serine/threonine-protein kinase 1 (MnK1) MAP-kinase interacting kinase 1 (MNK1) MKNK1 MNK1
Type:
Serine/threonine-protein kinase
Mol. Mass.:
51342.85
Organism:
Homo sapiens (Human)
Description:
Q9BUB5
Residue:
465
  
Inhibitor
Name:
BDBM181388
Synonyms:
US9139577, 1.019 | US9708274, 1.019
Type:
Small organic molecule
Emp. Form.:
C22H21ClFN5O3S
Mol. Mass.:
489.95
SMILES:
C[C@@H](Oc1cc(F)ccc1Nc1ncnc2cc(cc(Cl)c12)N=S(C)(C)=O)c1cc(C)no1
: