Target
Neutrophil elastase
Ligand
BDBM23705
Substrate
BDBM23699
Meas. Tech.
Human Neutrophil Elastase Inhibition Assay
pH
7.5±n/a
Temperature
298.15±n/a K
Ki
45±n/a nM
Citation
 Schepetkin, IAKhlebnikov, AIQuinn, MT N-benzoylpyrazoles are novel small-molecule inhibitors of human neutrophil elastase. J Med Chem 50:4928-38 (2007)  
Target
Name:
Neutrophil elastase
Synonyms:
Bone marrow serine protease Coagulation factor X ELANE Elastase HLE Leukocyte elastase Medullasin Neutrophil elastase (HNE) PMN elastase Trypsin
Type:
Enzyme
Mol. Mass.:
28532.38
Organism:
Homo sapiens (Human)
Description:
P08246
Residue:
267
  
Inhibitor
Name:
BDBM23705
Synonyms:
4-bromo-1-[(4-methylphenyl)carbonyl]-1H-pyrazole | N-Benzoylpyrazole deriv., 7
Type:
Small organic molecule
Emp. Form.:
C11H9BrN2O
Mol. Mass.:
265.106
SMILES:
Cc1ccc(cc1)C(=O)n1cc(Br)cn1
:
Substrate
Name:
BDBM23699
Synonyms:
N-methylsuccinyl-Ala-Ala-Pro-Val-7-amino-4-methylcoumarin
Type:
Chromogenic substrate
Emp. Form.:
Mol. Mass.:
SMILES:
: