Target
Neutrophil elastase
Ligand
BDBM23710
Substrate
BDBM23699
Meas. Tech.
Human Neutrophil Elastase Inhibition Assay
pH
7.5±n/a
Temperature
298.15±n/a K
Ki
28±n/a nM
Citation
 Schepetkin, IAKhlebnikov, AIQuinn, MT N-benzoylpyrazoles are novel small-molecule inhibitors of human neutrophil elastase. J Med Chem 50:4928-38 (2007)  
Target
Name:
Neutrophil elastase
Synonyms:
Bone marrow serine protease Coagulation factor X ELANE Elastase HLE Leukocyte elastase Medullasin Neutrophil elastase (HNE) PMN elastase Trypsin
Type:
Enzyme
Mol. Mass.:
28532.38
Organism:
Homo sapiens (Human)
Description:
P08246
Residue:
267
  
Inhibitor
Name:
BDBM23710
Synonyms:
1-[(4-methylphenyl)carbonyl]-3-nitro-1H-pyrazole | N-Benzoylpyrazole deriv., 18
Type:
Small organic molecule
Emp. Form.:
C11H9N3O3
Mol. Mass.:
231.2075
SMILES:
Cc1ccc(cc1)C(=O)n1ccc(n1)[N+]([O-])=O
:
Substrate
Name:
BDBM23699
Synonyms:
N-methylsuccinyl-Ala-Ala-Pro-Val-7-amino-4-methylcoumarin
Type:
Chromogenic substrate
Emp. Form.:
Mol. Mass.:
SMILES:
: