Target
Tyrosine-protein kinase BTK
Ligand
BDBM165208
Substrate
Meas. Tech.
Enzyme Assay
IC50
0.120±n/a nM
Citation
 Liu, QWatterson, SHAhmad, S Indole carboxamide compounds US Patent  US9920031 Publication Date 3/20/2018 
Target
Name:
Tyrosine-protein kinase BTK
Synonyms:
AGMX1 Agammaglobulinaemia tyrosine kinase B cell progenitor kinase BPK BTK_HUMAN Tyrosine Kinase BTK Tyrosine-protein kinase BTK (BTK)
Type:
Enzyme
Mol. Mass.:
76289.95
Organism:
Homo sapiens (Human)
Description:
Q06187
Residue:
659
  
Inhibitor
Name:
BDBM165208
Synonyms:
US10604504, Example 33 US9688629, 33 US9920031, Example 33
Type:
Small organic molecule
Emp. Form.:
C18H17N3O3S
Mol. Mass.:
355.411
SMILES:
Cc1c[nH]c2c(ccc(-c3cccc(NS(=O)(=O)C=C)c3)c12)C(N)=O
: