Target
Tyrosine-protein kinase BTK
Ligand
BDBM165303
Substrate
Meas. Tech.
Enzyme Assay
IC50
0.190±n/a nM
Citation
 Liu, QWatterson, SHAhmad, S Indole carboxamide compounds US Patent  US9920031 Publication Date 3/20/2018 
Target
Name:
Tyrosine-protein kinase BTK
Synonyms:
AGMX1 Agammaglobulinaemia tyrosine kinase B cell progenitor kinase BPK BTK_HUMAN Tyrosine Kinase BTK Tyrosine-protein kinase BTK (BTK)
Type:
Enzyme
Mol. Mass.:
76289.95
Organism:
Homo sapiens (Human)
Description:
Q06187
Residue:
659
  
Inhibitor
Name:
BDBM165303
Synonyms:
US10604504, Example 99 US9688629, 99 US9920031, Example 99
Type:
Small organic molecule
Emp. Form.:
C23H22FN3O2
Mol. Mass.:
391.4381
SMILES:
Cc1[nH]c2c(cc(F)c(-c3ccc4CCCN(C(=O)C=C)c4c3)c2c1C)C(N)=O
: