Target
Tyrosine-protein kinase BTK
Ligand
BDBM165343
Substrate
Meas. Tech.
Enzyme Assay
IC50
0.210±n/a nM
Citation
 Liu, QWatterson, SHAhmad, S Indole carboxamide compounds US Patent  US9920031 Publication Date 3/20/2018 
Target
Name:
Tyrosine-protein kinase BTK
Synonyms:
AGMX1 Agammaglobulinaemia tyrosine kinase B cell progenitor kinase BPK BTK_HUMAN Tyrosine Kinase BTK Tyrosine-protein kinase BTK (BTK)
Type:
Enzyme
Mol. Mass.:
76289.95
Organism:
Homo sapiens (Human)
Description:
Q06187
Residue:
659
  
Inhibitor
Name:
BDBM165343
Synonyms:
US10604504, Example 130 US9688629, 130 US9920031, Example 130
Type:
Small organic molecule
Emp. Form.:
C22H27FN4O2
Mol. Mass.:
398.4738
SMILES:
CCN([C@H]1CCCN(C1)c1c(F)cc(C(N)=O)c2[nH]c(C)c(C)c12)C(=O)C#CC
: